BDBM50341334 CHEMBL1766473::rel-(1R,2S,4R,5S)-6-[(1-Adamantyl-1H-1,2,3-triazol-4-yl)methylamino]cyclohexane-1,2,3,4,5-pentaol
SMILES O[C@H]1[C@H](O)[C@@H](O)[C@H](NCc2cn(CC34CC5CC(CC(C5)C3)C4)nn2)[C@@H](O)[C@@H]1O
InChI Key InChIKey=WUOWYKPGZRQBCX-ULOZQBBYSA-N
Data  1 KI  6 IC50
  Tab Delimited (TSV)   2D SDfile   Computed 3D by Vconf -m prep SDfile
Find this compound or compounds like it in BindingDB:
Activity Spreadsheet -- Enzyme Inhibition Constant Data from BindingDB
Found 7 hits for monomerid = 50341334
TargetLysosomal acid glucosylceramidase(Homo sapiens (Human))
Spanish National Research Council (Consejo Superior De Investigaciones Cienti£?Ficas)
Curated by ChEMBL
LigandPNGBDBM50341334(CHEMBL1766473 | rel-(1R,2S,4R,5S)-6-[(1-Adamantyl-...)
Affinity DataKi:  1.05E+3nM. Assay description: Competitive inhibition of recombinant glucocerebrosidase
In DepthDetails ArticlePubMed
TargetOligo-1,6-glucosidase IMA1(Saccharomyces cerevisiae S288c (Baker's yeast))
Spanish National Research Council (Consejo Superior De Investigaciones Cienti£?Ficas)
Curated by ChEMBL
LigandPNGBDBM50341334(CHEMBL1766473 | rel-(1R,2S,4R,5S)-6-[(1-Adamantyl-...)
Affinity DataIC50: >1.00E+5nM. Assay description: Inhibition of yeast alpha-glucosidase
In DepthDetails ArticlePubMed
TargetLysosomal acid glucosylceramidase(Homo sapiens (Human))
Spanish National Research Council (Consejo Superior De Investigaciones Cienti£?Ficas)
Curated by ChEMBL
LigandPNGBDBM50341334(CHEMBL1766473 | rel-(1R,2S,4R,5S)-6-[(1-Adamantyl-...)
Affinity DataIC50:  2.20E+3nMpH: 5.2Assay Description:Inhibition of recombinant glucocerebrosidase in McIlvaine buffer at pH 5.2 after 10 mins by fluorometric analysis
In DepthDetails ArticlePubMed
TargetAlpha-galactosidase(Coffea arabica (Coffee beans))
Spanish National Research Council (Consejo Superior De Investigaciones Cienti£?Ficas)
Curated by ChEMBL
LigandPNGBDBM50341334(CHEMBL1766473 | rel-(1R,2S,4R,5S)-6-[(1-Adamantyl-...)
Affinity DataIC50: >1.00E+5nM. Assay description: Inhibition of alpha-galactosidase from coffee beans
In DepthDetails ArticlePubMed
TargetBeta-galactosidase(Bos taurus (Bovine))
Spanish National Research Council (Consejo Superior De Investigaciones Cienti£?Ficas)
Curated by ChEMBL
LigandPNGBDBM50341334(CHEMBL1766473 | rel-(1R,2S,4R,5S)-6-[(1-Adamantyl-...)
Affinity DataIC50: >1.00E+5nM. Assay description: Inhibition of bovine liver beta-galactosidase
In DepthDetails ArticlePubMed
TargetLysosomal acid glucosylceramidase(Homo sapiens (Human))
Spanish National Research Council (Consejo Superior De Investigaciones Cienti£?Ficas)
Curated by ChEMBL
LigandPNGBDBM50341334(CHEMBL1766473 | rel-(1R,2S,4R,5S)-6-[(1-Adamantyl-...)
Affinity DataIC50:  1.90E+3nMpH: 7.4Assay Description:Inhibition of recombinant glucocerebrosidase in McIlvaine buffer at pH 7.4 after 10 mins by fluorometric analysis
In DepthDetails ArticlePubMed
TargetProbable alpha-glucosidase Os06g0675700(Oryza sativa subsp. japonica)
Spanish National Research Council (Consejo Superior De Investigaciones Cienti£?Ficas)
Curated by ChEMBL
LigandPNGBDBM50341334(CHEMBL1766473 | rel-(1R,2S,4R,5S)-6-[(1-Adamantyl-...)
Affinity DataIC50: >1.00E+5nM. Assay description: Inhibition of rice alpha-glucosidase
In DepthDetails ArticlePubMed