BDBM50344278 (R)-quinuclidin-3-yl butyl(thiophen-2-ylmethyl)carbamate::CHEMBL1779041
SMILES CCCCN(Cc1cccs1)C(=O)O[C@H]1CN2CCC1CC2
InChI Key InChIKey=CZTMYBUHNDAZEH-INIZCTEOSA-N
Data  3 IC50
  Tab Delimited (TSV)   2D SDfile   Computed 3D by Vconf -m prep SDfile
Find this compound or compounds like it in BindingDB:
Activity Spreadsheet -- Enzyme Inhibition Constant Data from BindingDB
Found 3 hits for monomerid = 50344278
TargetMuscarinic acetylcholine receptor M1(Homo sapiens (Human))
RhôNe-Poulenc Rorer
Curated by ChEMBL
LigandPNGBDBM50344278((R)-quinuclidin-3-yl butyl(thiophen-2-ylmethyl)car...)
Affinity DataIC50:  0.800nM. Assay description: Displacement of [3H]NMS from human muscarinic M1 receptor expressed in CHO-K1 cells after 1 hr by scintillation counting
In DepthDetails ArticlePubMed
TargetMuscarinic acetylcholine receptor M2(Homo sapiens (Human))
RhôNe-Poulenc Rorer
Curated by ChEMBL
LigandPNGBDBM50344278((R)-quinuclidin-3-yl butyl(thiophen-2-ylmethyl)car...)
Affinity DataIC50:  76.2nM. Assay description: Displacement of [3H]NMS from human muscarinic M2 receptor expressed in CHO-K1 cells after 1 hr by scintillation counting
In DepthDetails ArticlePubMed
TargetMuscarinic acetylcholine receptor M3(Homo sapiens (Human))
RhôNe-Poulenc Rorer
Curated by ChEMBL
LigandPNGBDBM50344278((R)-quinuclidin-3-yl butyl(thiophen-2-ylmethyl)car...)
Affinity DataIC50:  17.7nM. Assay description: Displacement of [3H]NMS from human muscarinic M3 receptor expressed in CHO-K1 cells after 1 hr by scintillation counting
In DepthDetails ArticlePubMed