BDBM50348670 CHEMBL1801052
SMILES ONC(=O)C1(CCOCC1)S(=O)(=O)c1ccc(Oc2ccc(OC(F)(F)F)cc2)cc1
InChI Key InChIKey=QLTNWLFWQKKDEO-UHFFFAOYSA-N
Data  7 IC50
  Tab Delimited (TSV)   2D SDfile   Computed 3D by Vconf -m prep SDfile
Find this compound or compounds like it in BindingDB:
Activity Spreadsheet -- Enzyme Inhibition Constant Data from BindingDB
Found 7 hits for monomerid = 50348670
TargetMatrix metalloproteinase-9(Homo sapiens (Human))
Pfizer
Curated by ChEMBL
LigandPNGBDBM50348670(CHEMBL1801052)
Affinity DataIC50:  0.200nM. Assay description: Inhibition of human MMP9 assessed as cleavage of fluorogenic peptide MCAPro-Leu-Gly-Leu-Dpa-Ala-Arg-NH2 by fluorometric assay
In DepthDetails ArticlePubMed
TargetMatrix metalloproteinase-14(Homo sapiens (Human))
Pfizer
Curated by ChEMBL
LigandPNGBDBM50348670(CHEMBL1801052)
Affinity DataIC50:  11nM. Assay description: Inhibition of human MMP14 assessed as cleavage of fluorogenic peptide MCAPro-Leu-Gly-Leu-Dpa-Ala-Arg-NH2 by fluorometric assay
In DepthDetails ArticlePubMed
Target72 kDa type IV collagenase(Homo sapiens (Human))
Pfizer
Curated by ChEMBL
LigandPNGBDBM50348670(CHEMBL1801052)
Affinity DataIC50: <0.100nM. Assay description: Inhibition of human MMP2 assessed as cleavage of fluorogenic peptide MCAPro-Leu-Gly-Leu-Dpa-Ala-Arg-NH2 by fluorometric assay
In DepthDetails ArticlePubMed
TargetInterstitial collagenase(Homo sapiens (Human))
Pfizer
Curated by ChEMBL
LigandPNGBDBM50348670(CHEMBL1801052)
Affinity DataIC50:  1.14E+3nM. Assay description: Inhibition of human MMP1 expressed in human HT-1080 cells assessed as cleavage of fluorogenic peptide MCAPro-Leu-Gly-Leu-Dpa-Ala-Arg-NH2 by fluoromet...
In DepthDetails ArticlePubMed
TargetNeutrophil collagenase(Homo sapiens (Human))
Pfizer
Curated by ChEMBL
LigandPNGBDBM50348670(CHEMBL1801052)
Affinity DataIC50:  0.900nM. Assay description: Inhibition of human MMP8 assessed as cleavage of fluorogenic peptide MCAPro-Leu-Gly-Leu-Dpa-Ala-Arg-NH2 by fluorometric assay
In DepthDetails ArticlePubMed
TargetStromelysin-1(Homo sapiens (Human))
Pfizer
Curated by ChEMBL
LigandPNGBDBM50348670(CHEMBL1801052)
Affinity DataIC50:  35nM. Assay description: Inhibition of human MMP3 assessed as cleavage of fluorogenic peptide MCAPro-Leu-Gly-Leu-Dpa-Ala-Arg-NH2 by fluorometric assay
In DepthDetails ArticlePubMed
TargetCollagenase 3(Homo sapiens (Human))
Pfizer
Curated by ChEMBL
LigandPNGBDBM50348670(CHEMBL1801052)
Affinity DataIC50: <0.100nM. Assay description: Inhibition of human MMP13 assessed as cleavage of fluorogenic peptide MCAPro-Leu-Gly-Leu-Dpa-Ala-Arg-NH2 by fluorometric assay
In DepthDetails ArticlePubMed