BDBM50350983 CHEMBL1818330
SMILES COC1CCN(Cc2ccc(cc2)-c2ccccc2S(=O)(=O)N2CCCC2)CC1
InChI Key InChIKey=OHCPUCJXJGWRQQ-UHFFFAOYSA-N
Data  2 KI
  Tab Delimited (TSV)   2D SDfile   Computed 3D by Vconf -m prep SDfile
Find this compound or compounds like it in BindingDB:
Activity Spreadsheet -- Enzyme Inhibition Constant Data from BindingDB
Found 2 hits for monomerid = 50350983
TargetKappa-type opioid receptor(Homo sapiens (Human))
Pfizer
Curated by ChEMBL
LigandPNGBDBM50350983(CHEMBL1818330)
Affinity DataKi:  2.20nM. Assay description: Displacement of [3H]diprenorphine from human kappa opioid receptor expressed in CHO cells after 1 hr by liquid scintillation counting
In DepthDetails ArticlePubMed
TargetMu-type opioid receptor(Homo sapiens (Human))
Pfizer
Curated by ChEMBL
LigandPNGBDBM50350983(CHEMBL1818330)
Affinity DataKi:  89nM. Assay description: Displacement of [3H]diprenorphine from human mu opioid receptor expressed in CHO cells after 1 hr by liquid scintillation counting
In DepthDetails ArticlePubMed