BDBM50351924 CHEMBL1821815
SMILES C[C@H](Cc1cc2cc(ccc2nc1N)-c1ccccc1C)C(=O)NCC1CCCCC1
InChI Key InChIKey=MQOILMOKFLJWRN-LJQANCHMSA-N
Data  1 IC50
  Tab Delimited (TSV)   2D SDfile   Computed 3D by Vconf -m prep SDfile
Find this compound or compounds like it in BindingDB:
Activity Spreadsheet -- Enzyme Inhibition Constant Data from BindingDB
Found 1 hit for monomerid = 50351924
TargetBeta-secretase 1(Homo sapiens (Human))
Amgen
Curated by ChEMBL
LigandPNGBDBM50351924(CHEMBL1821815)
Affinity DataIC50:  2.5nM. Assay description: Inhibition of human recombinant BACE1 after 60 mins by FRET assay
In DepthDetails ArticlePubMed