BDBM50353784 CHEMBL1829403
SMILES CCC(N(CCCN)C(=O)c1cccc(c1)C(F)(F)F)c1nc2ccsc2c(=O)n1Cc1ccccc1
InChI Key InChIKey=SENDUEUOHLBKIY-UHFFFAOYSA-N
Data  1 IC50
  Tab Delimited (TSV)   2D SDfile   Computed 3D by Vconf -m prep SDfile
Find this compound or compounds like it in BindingDB:
Activity Spreadsheet -- Enzyme Inhibition Constant Data from BindingDB
Found 1 hit for monomerid = 50353784
TargetKinesin-like protein KIF11(Homo sapiens (Human))
Astrazeneca
Curated by ChEMBL
LigandPNGBDBM50353784(CHEMBL1829403)
Affinity DataIC50:  310nM. Assay description: Inhibition of human recombinant C-terminal His6-tagged KSP ATPase activity after 1 hr by malachite green assay
In DepthDetails ArticlePubMed