BDBM50353786 CHEMBL1829258
SMILES CCC(N(CCCCN)C(=O)c1ccc(C)cc1)c1nc2ccsc2c(=O)n1Cc1ccccc1
InChI Key InChIKey=ZKLUXJVIKUKJPV-UHFFFAOYSA-N
Data  1 IC50
  Tab Delimited (TSV)   2D SDfile   Computed 3D by Vconf -m prep SDfile
Find this compound or compounds like it in BindingDB:
Activity Spreadsheet -- Enzyme Inhibition Constant Data from BindingDB
Found 1 hit for monomerid = 50353786
TargetKinesin-like protein KIF11(Homo sapiens (Human))
Astrazeneca
Curated by ChEMBL
LigandPNGBDBM50353786(CHEMBL1829258)
Affinity DataIC50:  390nM. Assay description: Inhibition of human recombinant C-terminal His6-tagged KSP ATPase activity after 1 hr by malachite green assay
In DepthDetails ArticlePubMed