BDBM50355113 CHEMBL1835581
SMILES CC1NC(=O)C(C#N)=C(SCc2ccccc2)S1
InChI Key InChIKey=BFIALVSRBPCDMI-UHFFFAOYSA-N
Data  1 IC50
  Tab Delimited (TSV)   2D SDfile   Computed 3D by Vconf -m prep SDfile
Find this compound or compounds like it in BindingDB:
Activity Spreadsheet -- Enzyme Inhibition Constant Data from BindingDB
Found 1 hit for monomerid = 50355113
Target4-diphosphocytidyl-2-C-methyl-D-erythritol kinase(Yersinia pestis)
University Of Utah
Curated by ChEMBL
LigandPNGBDBM50355113(CHEMBL1835581)
Affinity DataIC50:  1.50E+4nM. Assay description: Inhibition of His6-tagged Yersinia pestis KIM6 CDP-ME kinase assessed as ADP production after 30 mins by Kinase Glo luminescence-based assay or stand...
In DepthDetails ArticlePubMed