BDBM50357698 CHEMBL1915485
SMILES CN1CC(Oc2ccccc12)c1ccc(cc1)-c1ccccc1
InChI Key InChIKey=OJHFHFQRLRFUTR-UHFFFAOYSA-N
Data  1 IC50
  Tab Delimited (TSV)   2D SDfile   Computed 3D by Vconf -m prep SDfile
Find this compound or compounds like it in BindingDB:
Activity Spreadsheet -- Enzyme Inhibition Constant Data from BindingDB
Found 1 hit for monomerid = 50357698
TargetSqualene synthase(Rattus norvegicus)
University Of Athens
Curated by ChEMBL
LigandPNGBDBM50357698(CHEMBL1915485)
Affinity DataIC50:  5.70E+3nM. Assay description: Inhibition of rat microsomal squalene synthase activity assessed as conversion of [3H]FPP to squalene
In DepthDetails ArticlePubMed