BDBM50361851 CHEMBL1938803::US9150577, 55
SMILES O=C(Nc1nc2ccccc2[nH]1)c1ccc2cc3C(=O)NCCCn3c2c1
InChI Key InChIKey=TWQIEMARYWIEFU-UHFFFAOYSA-N
Data  3 IC50
  Tab Delimited (TSV)   2D SDfile   Computed 3D by Vconf -m prep SDfile
Find this compound or compounds like it in BindingDB:
Activity Spreadsheet -- Enzyme Inhibition Constant Data from BindingDB
Found 3 hits for monomerid = 50361851
TargetRibosomal protein S6 kinase alpha-2(Homo sapiens (Human))
Boehringer Ingelheim International
US Patent
LigandPNGBDBM50361851(CHEMBL1938803 | US9150577, 55)
Affinity DataIC50:  4.40nMpH: 7.5Assay Description:Human RSK2 protein, purchased from Invitrogen, is used to measure kinase activity utilizing Kinase Glo Plus (Promega) a homogeneous assay technology,...
In DepthDetails US Patent
TargetRibosomal protein S6 kinase alpha-3(Homo sapiens (Human))
Boehringer Ingelheim Pharmaceuticals
Curated by ChEMBL
LigandPNGBDBM50361851(CHEMBL1938803 | US9150577, 55)
Affinity DataIC50:  4nM. Assay description: Inhibition of RSK2 phosphorylation by luminescence assay
In DepthDetails ArticlePubMed
TargetRibosomal protein S6 kinase alpha-3(Homo sapiens (Human))
Boehringer Ingelheim Pharmaceuticals
Curated by ChEMBL
LigandPNGBDBM50361851(CHEMBL1938803 | US9150577, 55)
Affinity DataIC50: >1.00E+4nM. Assay description: Inhibition of RSK2-mediated CREB phosphorylation in HeLa cells expressing luciferase reporter gene
In DepthDetails ArticlePubMed