BDBM50366401 CHEMBL4169721
SMILES Cl.Cl.CCCc1ccncc1-c1ccc(CN)o1
InChI Key InChIKey=KRLAVZKZJIVVOU-UHFFFAOYSA-N
Data  9 IC50
  Tab Delimited (TSV)   2D SDfile   Computed 3D by Vconf -m prep SDfile
Find this compound or compounds like it in BindingDB:
Activity Spreadsheet -- Enzyme Inhibition Constant Data from BindingDB
Found 9 hits for monomerid = 50366401
TargetCytochrome P450 2C9(Homo sapiens (Human))
Washington State University
Curated by ChEMBL
LigandPNGBDBM50366401(CHEMBL4169721)
Affinity DataIC50:  1.90E+4nM. Assay description: Inhibition of CYP2C9 in human liver microsomes using diclofenac as substrate preincubated for 5 mins followed by addition of NADPH-regenerating syste...
In DepthDetails ArticlePubMed
TargetCytochrome P450 2D6(Homo sapiens (Human))
Washington State University
Curated by ChEMBL
LigandPNGBDBM50366401(CHEMBL4169721)
Affinity DataIC50:  1.70E+3nM. Assay description: Inhibition of CYP2D6 in human liver microsomes using dextromethorphan as substrate preincubated for 5 mins followed by addition of NADPH-regenerating...
In DepthDetails ArticlePubMed
TargetCytochrome P450 2E1(Homo sapiens (Human))
Washington State University
Curated by ChEMBL
LigandPNGBDBM50366401(CHEMBL4169721)
Affinity DataIC50:  1.90E+3nM. Assay description: Inhibition of CYP2E1 in human liver microsomes using chlorzoxazone as substrate preincubated for 5 mins followed by addition of NADPH-regenerating sy...
In DepthDetails ArticlePubMed
TargetCytochrome P450 3A4(Homo sapiens (Human))
Washington State University
Curated by ChEMBL
LigandPNGBDBM50366401(CHEMBL4169721)
Affinity DataIC50:  4.90E+3nM. Assay description: Inhibition of CYP3A4 in human liver microsomes using midazolam as substrate preincubated for 5 mins followed by addition of NADPH-regenerating system...
In DepthDetails ArticlePubMed
TargetCytochrome P450 1A2(Homo sapiens (Human))
Washington State University
Curated by ChEMBL
LigandPNGBDBM50366401(CHEMBL4169721)
Affinity DataIC50:  370nM. Assay description: Inhibition of CYP1A2 in human liver microsomes using phenacetin as substrate preincubated for 5 mins followed by addition of NADPH-regenerating syste...
In DepthDetails ArticlePubMed
TargetCytochrome P450 2B6(Homo sapiens (Human))
Washington State University
Curated by ChEMBL
LigandPNGBDBM50366401(CHEMBL4169721)
Affinity DataIC50:  370nM. Assay description: Inhibition of CYP2B6 in human liver microsomes using bupropion as substrate preincubated for 5 mins followed by addition of NADPH-regenerating system...
In DepthDetails ArticlePubMed
TargetCytochrome P450 2C8(Homo sapiens (Human))
Washington State University
Curated by ChEMBL
LigandPNGBDBM50366401(CHEMBL4169721)
Affinity DataIC50:  260nM. Assay description: Inhibition of CYP2C8 in human liver microsomes using amodiaquine as substrate preincubated for 5 mins followed by addition of NADPH-regenerating syst...
In DepthDetails ArticlePubMed
TargetCytochrome P450 2C19(Homo sapiens (Human))
Washington State University
Curated by ChEMBL
LigandPNGBDBM50366401(CHEMBL4169721)
Affinity DataIC50:  2.00E+3nM. Assay description: Inhibition of CYP2C19 in human liver microsomes using omeprazole as substrate preincubated for 5 mins followed by addition of NADPH-regenerating syst...
In DepthDetails ArticlePubMed
TargetCytochrome P450 2A6(Homo sapiens (Human))
Washington State University
Curated by ChEMBL
LigandPNGBDBM50366401(CHEMBL4169721)
Affinity DataIC50:  140nM. Assay description: Inhibition of CYP2A6 in human liver microsomes using coumarin as substrate preincubated for 5 mins followed by addition of NADPH-regenerating system ...
In DepthDetails ArticlePubMed