BDBM50366976 CHEMBL102691
SMILES CCOC(CCP(=O)(OCC)OCC)OCC
InChI Key InChIKey=WKPXMGJOGYEGNW-UHFFFAOYSA-N
Data  1 KI
  Tab Delimited (TSV)   2D SDfile   Computed 3D by Vconf -m prep SDfile
Find this compound or compounds like it in BindingDB:
Activity Spreadsheet -- Enzyme Inhibition Constant Data from BindingDB
Found 1 hit for monomerid = 50366976
TargetAldehyde oxidase(Homo sapiens (Human))
TBA
Curated by ChEMBL
LigandPNGBDBM50366976(CHEMBL102691)
Affinity DataKi:  2.00E+5nM. Assay description: Tested for its ability to inhibit rabbit liver aldehyde oxidase catalyzed oxidation of N-methyl-nicotinamide (NMN)
In DepthDetails ArticlePubMed