BDBM50367091 CHEMBL1788162
SMILES O[C@H]1[C@@H](O)C(O[C@@H]1COP(O)(=O)OP(O)(=O)OP(O)([O-])=O)n1cnc2c(NCCCCCNC(=O)CI)ncnc12
InChI Key InChIKey=JJAVQSCPFVPNLA-NVONZOAYSA-M
Data  1 KI
  Tab Delimited (TSV)   2D SDfile   Computed 3D by Vconf -m prep SDfile
Find this compound or compounds like it in BindingDB:
Activity Spreadsheet -- Enzyme Inhibition Constant Data from BindingDB
Found 1 hit for monomerid = 50367091
TargetGTP:AMP phosphotransferase AK3, mitochondrial(Rattus norvegicus)
TBA
Curated by ChEMBL
LigandPNGBDBM50367091(CHEMBL1788162)
Affinity DataKi:  6.20E+6nM. Assay description: Competitive binding inhibition constant of rat adenylate kinase IIl was determined
In DepthDetails ArticlePubMed