BDBM50367092 CHEMBL1744387
SMILES CC(=O)NCCCCCCNc1ncnc2n(cnc12)C1O[C@H](COP(O)(=O)OP(O)(=O)OP(O)([O-])=O)[C@@H](O)[C@H]1O
InChI Key InChIKey=RWCYUHWDOIKAMW-PZGKNFOESA-M
Data  1 KI
  Tab Delimited (TSV)   2D SDfile   Computed 3D by Vconf -m prep SDfile
Find this compound or compounds like it in BindingDB:
Activity Spreadsheet -- Enzyme Inhibition Constant Data from BindingDB
Found 1 hit for monomerid = 50367092
TargetGTP:AMP phosphotransferase AK3, mitochondrial(Rattus norvegicus)
TBA
Curated by ChEMBL
LigandPNGBDBM50367092(CHEMBL1744387)
Affinity DataKi:  4.80E+6nM. Assay description: Competitive binding inhibition constant of rat Adenylate kinase III was determined
In DepthDetails ArticlePubMed