BDBM50367387 CHEMBL606503
SMILES CCC(CC)Nc1ncnc2n(cnc12)C1O[C@@H]([C@@H](O)[C@H]1O)C(O)=O
InChI Key InChIKey=SJVQSCPDBPXBLP-JSIFYMHPSA-N
Data  1 IC50  2 EC50
  Tab Delimited (TSV)   2D SDfile   Computed 3D by Vconf -m prep SDfile
Find this compound or compounds like it in BindingDB:
Activity Spreadsheet -- Enzyme Inhibition Constant Data from BindingDB
Found 3 hits for monomerid = 50367387
TargetAdenosine receptor A1(Rattus norvegicus (rat))
TBA
Curated by ChEMBL
LigandPNGBDBM50367387(CHEMBL606503)
Affinity DataIC50:  1.20nM. Assay description: Potency against rat brain adenosine A1 receptor
In DepthDetails ArticlePubMed
TargetAdenosine receptor A2a/A2b(Rattus norvegicus)
TBA
Curated by ChEMBL
LigandPNGBDBM50367387(CHEMBL606503)
Affinity DataEC50:  820nM. Assay description: Potency against PC12 cell A2 adenosine receptor by adenylate cyclase activation
In DepthDetails ArticlePubMed
TargetAdenosine receptor A2a/A2b(Homo sapiens (Human))
TBA
Curated by ChEMBL
LigandPNGBDBM50367387(CHEMBL606503)
Affinity DataEC50:  950nM. Assay description: Potency against human platelet A2 adenosine receptor
In DepthDetails ArticlePubMed