BDBM50368791 CHEMBL4171931
SMILES Nc1nc(NCCCCCNC(=O)c2ccc(cc2)S(F)(=O)=O)nc2nc(nn12)-c1ccco1
InChI Key InChIKey=IJFJBEYLUQTMCS-UHFFFAOYSA-N
Data  2 KI
  Tab Delimited (TSV)   2D SDfile   Computed 3D by Vconf -m prep SDfile
Find this compound or compounds like it in BindingDB:
Activity Spreadsheet -- Enzyme Inhibition Constant Data from BindingDB
Found 2 hits for monomerid = 50368791
TargetAdenosine receptor A2a(Homo sapiens (Human))
Astrazeneca
Curated by ChEMBL
LigandPNGBDBM50368791(CHEMBL4171931)
Affinity DataKi:  0.617nM. Assay description: Displacement of [3H]ZM241385 human A2AR (1 to 316 residues) expressed in Pichia pastoris SMD1168 cell membranes incubated for 3 hrs
In DepthDetails ArticlePubMed
TargetAdenosine receptor A2a(Homo sapiens (Human))
Astrazeneca
Curated by ChEMBL
LigandPNGBDBM50368791(CHEMBL4171931)
Affinity DataKi:  2.80nM. Assay description: Displacement of [3H]ZM241385 human A2AR (1 to 316 residues) expressed in Pichia pastoris SMD1168 cell membranes incubated for 0.5 hrs
In DepthDetails ArticlePubMed