BDBM50374180 CHEMBL404071
SMILES Oc1ccc(cc1Cl)C(=O)N\N=C\c1cccc(COc2ccc(cc2)C(F)(F)F)c1
InChI Key InChIKey=BJEJRRCSYWRGIP-KKMKTNMSSA-N
Data  1 KI
  Tab Delimited (TSV)   2D SDfile   Computed 3D by Vconf -m prep SDfile
Find this compound or compounds like it in BindingDB:
Activity Spreadsheet -- Enzyme Inhibition Constant Data from BindingDB
Found 1 hit for monomerid = 50374180
TargetPituitary adenylate cyclase-activating polypeptide type I receptor(Homo sapiens (Human))
Abbott Laboratories
Curated by ChEMBL
LigandPNGBDBM50374180(CHEMBL404071)
Affinity DataKi:  241nM. Assay description: Displacement of [125I]PACAP27 from PAC1R expressed in HEK293f cells
In DepthDetails ArticlePubMed