BDBM50379825 CHEMBL2011701
SMILES OC(=O)c1ccc(CN2C(=O)\C(S\C2=N/c2ccc(cc2)C(F)(F)F)=C\c2ccc(OCc3ccccc3)cc2)cc1
InChI Key InChIKey=NWQQGEXGFLBXEX-SJIIYNIPSA-N
Data  1 KI  4 IC50
  Tab Delimited (TSV)   2D SDfile   Computed 3D by Vconf -m prep SDfile
Find this compound or compounds like it in BindingDB:
Activity Spreadsheet -- Enzyme Inhibition Constant Data from BindingDB
Found 5 hits for monomerid = 50379825
TargetTyrosine-protein phosphatase non-receptor type 1(Homo sapiens (Human))
University Of Messina
Curated by ChEMBL
LigandPNGBDBM50379825(CHEMBL2011701)
Affinity DataKi:  1.20E+3nM. Assay description: Competitive inhibition of GST-tagged human recombinant PTP1B expressed in Escherichia coli TB1 using p-nitrophenylphosphate as substrate by Line-Weav...
In DepthDetails ArticlePubMed
TargetTyrosine-protein phosphatase non-receptor type 2(Homo sapiens (Human))
University Of Messina
Curated by ChEMBL
LigandPNGBDBM50379825(CHEMBL2011701)
Affinity DataIC50:  2.20E+3nM. Assay description: Competitive inhibition of human recombinant TCPTP using p-nitrophenylphosphate as substrate by Line-Weaver Burk plot
In DepthDetails ArticlePubMed
TargetTyrosine-protein phosphatase non-receptor type 1(Homo sapiens (Human))
University Of Messina
Curated by ChEMBL
LigandPNGBDBM50379825(CHEMBL2011701)
Affinity DataIC50:  1.40E+3nM. Assay description: Competitive inhibition of GST-tagged human recombinant PTP1B expressed in Escherichia coli TB1 using p-nitrophenylphosphate as substrate by Line-Weav...
In DepthDetails ArticlePubMed
TargetLow molecular weight phosphotyrosine protein phosphatase(Homo sapiens (Human))
University Of Messina
Curated by ChEMBL
LigandPNGBDBM50379825(CHEMBL2011701)
Affinity DataIC50:  2.54E+4nM. Assay description: Competitive inhibition of GST-tagged human recombinant LMW-PTP IF2 expressed in Escherichia coli TB1 using p-nitrophenylphosphate as substrate by Lin...
In DepthDetails ArticlePubMed
TargetLow molecular weight phosphotyrosine protein phosphatase(Homo sapiens (Human))
University Of Messina
Curated by ChEMBL
LigandPNGBDBM50379825(CHEMBL2011701)
Affinity DataIC50:  4.00E+3nM. Assay description: Competitive inhibition of GST-tagged human recombinant LMW-PTP IF1 expressed in Escherichia coli TB1 using p-nitrophenylphosphate as substrate by Lin...
In DepthDetails ArticlePubMed