BDBM50380152 CHEMBL2010999
SMILES CCc1cnc(SCC(=O)c2ccc(Cl)c(c2)S(N)(=O)=O)nc1
InChI Key InChIKey=SAVHXXXMJJLUJH-UHFFFAOYSA-N
Data  14 Kd
PDB links: 1 PDB ID matches this monomer.
  Tab Delimited (TSV)   2D SDfile   Computed 3D by Vconf -m prep SDfile
Find this compound or compounds like it in BindingDB:
Activity Spreadsheet -- Enzyme Inhibition Constant Data from BindingDB
Found 14 hits for monomerid = 50380152
TargetCarbonic anhydrase 13(Homo sapiens (Human))
Vilnius University
Curated by ChEMBL
LigandPNGBDBM50380152(CHEMBL2010999)
Affinity DataKd:  110nM. Assay description: Binding affinity to human recombinant carbonic anhydrase-13 by isothermal titration calorimetry assay
In DepthDetails ArticlePubMed
TargetCarbonic anhydrase 13(Homo sapiens (Human))
Vilnius University
Curated by ChEMBL
LigandPNGBDBM50380152(CHEMBL2010999)
Affinity DataKd:  110nM. Assay description: Binding affinity to human recombinant carbonic anhydrase-13 by thermal shift assay
In DepthDetails ArticlePubMed
TargetCarbonic anhydrase 7(Homo sapiens (Human))
Vilnius University
Curated by ChEMBL
LigandPNGBDBM50380152(CHEMBL2010999)
Affinity DataKd:  430nM. Assay description: Binding affinity to human recombinant carbonic anhydrase-7 by isothermal titration calorimetry assay
In DepthDetails ArticlePubMed
TargetCarbonic anhydrase 7(Homo sapiens (Human))
Vilnius University
Curated by ChEMBL
LigandPNGBDBM50380152(CHEMBL2010999)
Affinity DataKd:  330nM. Assay description: Binding affinity to human recombinant carbonic anhydrase-7 by thermal shift assay
In DepthDetails ArticlePubMed
TargetCarbonic anhydrase 2(Homo sapiens (Human))
Vilnius University
Curated by ChEMBL
LigandPNGBDBM50380152(CHEMBL2010999)
Affinity DataKd:  270nM. Assay description: Binding affinity to human recombinant carbonic anhydrase-2 by isothermal titration calorimetry assay
TargetCarbonic anhydrase 2(Homo sapiens (Human))
Vilnius University
Curated by ChEMBL
LigandPNGBDBM50380152(CHEMBL2010999)
Affinity DataKd:  140nM. Assay description: Binding affinity to human recombinant carbonic anhydrase-2 by thermal shift assay
TargetCarbonic anhydrase 1(Homo sapiens (Human))
Vilnius University
Curated by ChEMBL
LigandPNGBDBM50380152(CHEMBL2010999)
Affinity DataKd:  1.82E+3nM. Assay description: Binding affinity to human recombinant carbonic anhydrase 1 expressed in Escherichia coli BL21 (DE3) by thermal shift assay
In DepthDetails ArticlePubMed
TargetCarbonic anhydrase 1(Homo sapiens (Human))
Vilnius University
Curated by ChEMBL
LigandPNGBDBM50380152(CHEMBL2010999)
Affinity DataKd:  1.80E+3nM. Assay description: Binding affinity to human recombinant carbonic anhydrase-1 by thermal shift assay
In DepthDetails ArticlePubMed
TargetCarbonic anhydrase 13(Homo sapiens (Human))
Vilnius University
Curated by ChEMBL
LigandPNGBDBM50380152(CHEMBL2010999)
Affinity DataKd:  111nM. Assay description: Binding affinity to human recombinant carbonic anhydrase 13 by thermal shift assay
In DepthDetails ArticlePubMed
TargetCarbonic anhydrase 12(Homo sapiens (Human))
Vilnius University
Curated by ChEMBL
LigandPNGBDBM50380152(CHEMBL2010999)
Affinity DataKd:  1.25E+3nM. Assay description: Binding affinity to human recombinant carbonic anhydrase 12 by thermal shift assay
In DepthDetails ArticlePubMed
TargetCarbonic anhydrase 6(Homo sapiens (Human))
Vilnius University
Curated by ChEMBL
LigandPNGBDBM50380152(CHEMBL2010999)
Affinity DataKd:  670nM. Assay description: Binding affinity to human recombinant carbonic anhydrase 6 expressed in Escherichia coli Rosetta2 (DE3) by thermal shift assay
In DepthDetails ArticlePubMed
TargetCarbonic anhydrase 2(Homo sapiens (Human))
Vilnius University
Curated by ChEMBL
LigandPNGBDBM50380152(CHEMBL2010999)
Affinity DataKd:  143nM. Assay description: Binding affinity to human recombinant carbonic anhydrase 2 by thermal shift assay
TargetCarbonic anhydrase 7(Homo sapiens (Human))
Vilnius University
Curated by ChEMBL
LigandPNGBDBM50380152(CHEMBL2010999)
Affinity DataKd:  333nM. Assay description: Binding affinity to human recombinant carbonic anhydrase 7 by thermal shift assay
In DepthDetails ArticlePubMed
TargetCarbonic anhydrase 1(Homo sapiens (Human))
Vilnius University
Curated by ChEMBL
LigandPNGBDBM50380152(CHEMBL2010999)
Affinity DataKd:  880nM. Assay description: Binding affinity to human recombinant carbonic anhydrase-1 by isothermal titration calorimetry assay
In DepthDetails ArticlePubMed