BDBM50382118 CHEMBL2024331
SMILES CCOC(=O)N1C2CCC1CC(C2)N1CCC[C@H](C1)NC(=O)c1ccccc1C
InChI Key InChIKey=AJSHPFXXSLQSKN-NEYBNPPJSA-N
Data  6 EC50
  Tab Delimited (TSV)   2D SDfile   Computed 3D by Vconf -m prep SDfile
Find this compound or compounds like it in BindingDB:
Activity Spreadsheet -- Enzyme Inhibition Constant Data from BindingDB
Found 6 hits for monomerid = 50382118
TargetMuscarinic acetylcholine receptor M1(Homo sapiens (Human))
Vanderbilt University Medical Center
Curated by ChEMBL
LigandPNGBDBM50382118(CHEMBL2024331)
Affinity DataEC50:  17nM. Assay description: Agonist activity at human muscarinic M1 receptor by calcium mobilization assay
In DepthDetails ArticlePubMed
TargetMuscarinic acetylcholine receptor M4(Homo sapiens (Human))
Vanderbilt University Medical Center
Curated by ChEMBL
LigandPNGBDBM50382118(CHEMBL2024331)
Affinity DataEC50: >1.00E+4nM. Assay description: Agonist activity at human muscarinic M4 receptor by calcium mobilization assay
In DepthDetails ArticlePubMed
TargetMuscarinic acetylcholine receptor M3(Homo sapiens (Human))
Vanderbilt University Medical Center
Curated by ChEMBL
LigandPNGBDBM50382118(CHEMBL2024331)
Affinity DataEC50: >1.00E+4nM. Assay description: Agonist activity at human muscarinic M3 receptor by calcium mobilization assay
In DepthDetails ArticlePubMed
TargetMuscarinic acetylcholine receptor M2(Homo sapiens (Human))
Vanderbilt University Medical Center
Curated by ChEMBL
LigandPNGBDBM50382118(CHEMBL2024331)
Affinity DataEC50:  1.80E+3nM. Assay description: Agonist activity at human muscarinic M2 receptor by calcium mobilization assay
In DepthDetails ArticlePubMed
TargetMuscarinic acetylcholine receptor M5(Homo sapiens (Human))
Vanderbilt University Medical Center
Curated by ChEMBL
LigandPNGBDBM50382118(CHEMBL2024331)
Affinity DataEC50:  3.70E+3nM. Assay description: Agonist activity at human muscarinic M5 receptor by calcium mobilization assay
In DepthDetails ArticlePubMed
TargetMuscarinic acetylcholine receptor M1(Homo sapiens (Human))
Vanderbilt University Medical Center
Curated by ChEMBL
LigandPNGBDBM50382118(CHEMBL2024331)
Affinity DataEC50:  59nM. Assay description: Agonist activity at human muscarinic M1 receptor
In DepthDetails ArticlePubMed