BDBM50382348 CHEMBL2024342
SMILES COc1ccccc1C(=O)CC(SCCNC(=O)CCNC(=O)[C@H](O)C(C)(C)COP(O)(=O)OP(O)(=O)OC[C@H]1O[C@H]([C@H](O)[C@@H]1OP(O)(O)=O)n1cnc2c(N)ncnc12)C(O)=O
InChI Key InChIKey=YFDUBKBWVNCNMG-QENOOWRWSA-N
Data  1 IC50
  Tab Delimited (TSV)   2D SDfile   Computed 3D by Vconf -m prep SDfile
Find this compound or compounds like it in BindingDB:
Activity Spreadsheet -- Enzyme Inhibition Constant Data from BindingDB
Found 1 hit for monomerid = 50382348
Target1,4-dihydroxy-2-naphthoyl-CoA synthase(Mycobacterium tuberculosis)
TBA
Curated by ChEMBL
LigandPNGBDBM50382348(CHEMBL2024342)
Affinity DataIC50:  1.21E+4nM. Assay description: Inhibition of Mycobacterium tuberculosis MenB expressed in Escherichia coli BL21 (DE3) assessed as formation of DHNA-CoA from OSB-CoA by enzyme coupl...
In DepthDetails ArticlePubMed