BDBM50382961 CHEMBL1231802
SMILES Cc1cn([C@@H]2O[C@H](CO)[C@@H](O)[C@H](O)[C@H]2O)c(=O)[nH]c1=O
InChI Key InChIKey=RMXUFBPORJBBEZ-HPFNVAMJSA-N
Data  1 IC50
PDB links: 1 PDB ID matches this monomer.
  Tab Delimited (TSV)   2D SDfile   Computed 3D by Vconf -m prep SDfile
Find this compound or compounds like it in BindingDB:
Activity Spreadsheet -- Enzyme Inhibition Constant Data from BindingDB
Found 1 hit for monomerid = 50382961
TargetGlycogen phosphorylase, muscle form(Oryctolagus cuniculus (rabbit))
Universit£
Curated by ChEMBL
LigandPNGBDBM50382961(CHEMBL1231802)
Affinity DataIC50:  6.60E+3nM. Assay description: Binding affinity to rabbit muscular GPb by NMR binding assay