BDBM50387753 CHEMBL2058614
SMILES COc1ccc(Sc2ccccc2CSC(N)=N)c(CSC(N)=N)c1
InChI Key InChIKey=CXRHXJYNKBOVOY-UHFFFAOYSA-N
Data  1 IC50
  Tab Delimited (TSV)   2D SDfile   Computed 3D by Vconf -m prep SDfile
Find this compound or compounds like it in BindingDB:
Activity Spreadsheet -- Enzyme Inhibition Constant Data from BindingDB
Found 1 hit for monomerid = 50387753
TargetNatural resistance-associated macrophage protein 1(Homo sapiens (Human))
Xenon Pharmaceuticals
Curated by ChEMBL
LigandPNGBDBM50387753(CHEMBL2058614)
Affinity DataIC50: >1.00E+4nM. Assay description: Inhibition of NRAMP1 expressed in CHO cells
In DepthDetails ArticlePubMed