BDBM50388142 CHEMBL2058173
SMILES Cn1cnc2n(C)c(=O)n(CCCCn3c(=O)n(C)c4ncn(C)c4c3=O)c(=O)c12
InChI Key InChIKey=PXFLHKVXISJBOA-UHFFFAOYSA-N
Data  2 IC50
  Tab Delimited (TSV)   2D SDfile   Computed 3D by Vconf -m prep SDfile
Find this compound or compounds like it in BindingDB:
Activity Spreadsheet -- Enzyme Inhibition Constant Data from BindingDB
Found 2 hits for monomerid = 50388142
TargetEndochitinase A1(Neosartorya fumigata (Aspergillus fumigatus))
TBA
Curated by ChEMBL
LigandPNGBDBM50388142(CHEMBL2058173)
Affinity DataIC50: >1.00E+6nM. Assay description: Inhibition of Aspergillus fumigatus chitinaseA1 using 4-methyumbelliferyl-beta-B-N,N'-triacetylchitotriose as substrate after 10 mins
In DepthDetails ArticlePubMed
TargetEndochitinase B1(Aspergillus fumigatus)
TBA
Curated by ChEMBL
LigandPNGBDBM50388142(CHEMBL2058173)
Affinity DataIC50:  9.00E+3nM. Assay description: Inhibition of Aspergillus fumigatus ChitinaseB1 expressed in Escherichia coli using 4-methyumbelliferyl-beta-B-N,N'-diacetylchitobiose after 10 mins
In DepthDetails ArticlePubMed