BDBM50389137 CHEMBL2064643
SMILES CNC(=O)[C@@]12C[C@@H]1[C@H]([C@H](O)[C@@H]2O)n1cnc2c(NC)nc(nc12)C#Cc1ccc(Br)cc1
InChI Key InChIKey=XVBUNRKZGSOSDO-QKWCYAJMSA-N
Data  1 KI
  Tab Delimited (TSV)   2D SDfile   Computed 3D by Vconf -m prep SDfile
Find this compound or compounds like it in BindingDB:
Activity Spreadsheet -- Enzyme Inhibition Constant Data from BindingDB
Found 1 hit for monomerid = 50389137
TargetAdenosine receptor A3(Homo sapiens (Human))
National Institute Of Diabetes And Digestive And Kidney Diseases
Curated by ChEMBL
LigandPNGBDBM50389137(CHEMBL2064643)
Affinity DataKi:  0.910nM. Assay description: Displacement of [3H]I-AB-MECA from human recombinant adenosine A3 receptor expressed in CHO cells after 60 mins by gamma counting
In DepthDetails ArticlePubMed