BDBM50389817 CHEMBL2070702
SMILES NC(=O)Nc1cc(sc1C(=O)N[C@H]1CCCNC1)-c1ccc(F)cc1
InChI Key InChIKey=RQLNCXGTAKGPAC-LBPRGKRZSA-N
Data  1 IC50  2 EC50
  Tab Delimited (TSV)   2D SDfile   Computed 3D by Vconf -m prep SDfile
Find this compound or compounds like it in BindingDB:
Activity Spreadsheet -- Enzyme Inhibition Constant Data from BindingDB
Found 3 hits for monomerid = 50389817
TargetSerine/threonine-protein kinase Chk1(Homo sapiens (Human))
Astrazeneca
Curated by ChEMBL
LigandPNGBDBM50389817(CHEMBL2070702)
Affinity DataEC50:  1.30E+4nM. Assay description: Inhibition of CHK1 in human HT29 cells assessed as check point abrogation
In DepthDetails ArticlePubMed
TargetSerine/threonine-protein kinase Chk1(Homo sapiens (Human))
Astrazeneca
Curated by ChEMBL
LigandPNGBDBM50389817(CHEMBL2070702)
Affinity DataIC50:  6nM. Assay description: Inhibition of human recombinant CHK1 expressed in insect cells using biotinylaminohexanoyl-KKVSRSGLYRSPMPENLNRPR as substrate after 2 hrs by scintill...
In DepthDetails ArticlePubMed
TargetSerine/threonine-protein kinase Chk1(Homo sapiens (Human))
Astrazeneca
Curated by ChEMBL
LigandPNGBDBM50389817(CHEMBL2070702)
Affinity DataEC50:  20nM. Assay description: Inhibition of CHK1 in human HT29 cells assessed as abrogation of campothecin induced check point
In DepthDetails ArticlePubMed