BDBM50392892 CHEMBL2152100
SMILES C=CC(=O)NC1CCN(CC1)S(=O)(=O)c1ccc(cc1)C(=O)NCCCc1ccccc1
InChI Key InChIKey=PYIXMQASMNXJMU-UHFFFAOYSA-N
Data  1 IC50
  Tab Delimited (TSV)   2D SDfile   Computed 3D by Vconf -m prep SDfile
Find this compound or compounds like it in BindingDB:
Activity Spreadsheet -- Enzyme Inhibition Constant Data from BindingDB
Found 1 hit for monomerid = 50392892
TargetProtein-glutamine gamma-glutamyltransferase 2(Homo sapiens (Human))
TBA
Curated by ChEMBL
LigandPNGBDBM50392892(CHEMBL2152100)
Affinity DataIC50:  770nM. Assay description: Inhibition of human TGM2
In DepthDetails ArticlePubMed