BDBM50393496 CHEMBL2159935
SMILES Cc1ccc2[nH]c(=O)c(cc2c1)C(N1CCCC2(CCCCC2)C1)c1nnnn1C1CCCO1
InChI Key InChIKey=HZMDOJYDKAZVJW-UHFFFAOYSA-N
Data  2 KI  1 IC50
  Tab Delimited (TSV)   2D SDfile   Computed 3D by Vconf -m prep SDfile
Find this compound or compounds like it in BindingDB:
Activity Spreadsheet -- Enzyme Inhibition Constant Data from BindingDB
Found 3 hits for monomerid = 50393496
TargetTyrosine-protein phosphatase non-receptor type 22(Homo sapiens (Human))
University Of Southern California
Curated by ChEMBL
LigandPNGBDBM50393496(CHEMBL2159935)
Affinity DataKi:  3.07E+3nM. Assay description: Inhibition of LYP expressed in Escherichia coli BL21 using increasing levels of ARLIED-NEpYTAREG substrate
In DepthDetails ArticlePubMed
TargetTyrosine-protein phosphatase non-receptor type 22(Homo sapiens (Human))
University Of Southern California
Curated by ChEMBL
LigandPNGBDBM50393496(CHEMBL2159935)
Affinity DataKi:  1.76E+4nM. Assay description: Noncompetitive inhibition of LYP expressed in Escherichia coli BL21 using increasing levels of ARLIED-NEpYTAREG substrate
In DepthDetails ArticlePubMed
TargetTyrosine-protein phosphatase non-receptor type 22(Homo sapiens (Human))
University Of Southern California
Curated by ChEMBL
LigandPNGBDBM50393496(CHEMBL2159935)
Affinity DataIC50:  5.58E+3nM. Assay description: Inhibition of LYP expressed in Escherichia coli BL21 using pNPP substrate
In DepthDetails ArticlePubMed