BDBM50394171 CHEMBL2158847
SMILES NS(=O)(=O)c1ccc(Nc2nccc(n2)-c2ccnc(c2)N2CCOCC2)cc1
InChI Key InChIKey=AOJSSOWZWDZCBX-UHFFFAOYSA-N
Data  2 IC50
  Tab Delimited (TSV)   2D SDfile   Computed 3D by Vconf -m prep SDfile
Find this compound or compounds like it in BindingDB:
Activity Spreadsheet -- Enzyme Inhibition Constant Data from BindingDB
Found 2 hits for monomerid = 50394171
TargetSerine/threonine-protein kinase SMG1(Homo sapiens (Human))
Pfizer
Curated by ChEMBL
LigandPNGBDBM50394171(CHEMBL2158847)
Affinity DataIC50:  370nM. Assay description: Inhibition of human recombinant SMG1 expressed in HEK293 cells using GST-tagged p53 as substrate after 1 hr by DELFIA assay
In DepthDetails ArticlePubMed
TargetSerine/threonine-protein kinase mTOR(Homo sapiens (Human))
Pfizer
Curated by ChEMBL
LigandPNGBDBM50394171(CHEMBL2158847)
Affinity DataIC50: >2.00E+4nM. Assay description: Inhibition of mTOR
In DepthDetails ArticlePubMed