BDBM50398608 MARIZOMIB
SMILES C[C@@]12OC(=O)[C@@]1(NC(=O)[C@@H]2CCCl)[C@@H](O)[C@H]1CCCC=C1
InChI Key InChIKey=NGWSFRIPKNWYAO-SHTIJGAHSA-N
Data  8 IC50
  Tab Delimited (TSV)   2D SDfile   Computed 3D by Vconf -m prep SDfile
Find this compound or compounds like it in BindingDB:
Activity Spreadsheet -- Enzyme Inhibition Constant Data from BindingDB
Found 8 hits for monomerid = 50398608
TargetProteasome subunit beta type-5(Homo sapiens (Human))
The Pennsylvania State University
Curated by ChEMBL
LigandPNGBDBM50398608(MARIZOMIB)
Affinity DataIC50:  22nM. Assay description: Inhibition of chymotrypsin like activity of human 20S proteasome after 1 hr by luminescence assay
In DepthDetails ArticlePubMed
TargetProteasome subunit beta type-1(Homo sapiens (Human))
University Of California San Diego
Curated by ChEMBL
LigandPNGBDBM50398608(MARIZOMIB)
Affinity DataIC50:  430nM. Assay description: Reversible inhibition of human erythrocyte derived 20S proteasome subunit beta1 after 30 mins by fluorogenic assay
In DepthDetails ArticlePubMed
TargetProteasome subunit beta type-2(Homo sapiens (Human))
University Of California San Diego
Curated by ChEMBL
LigandPNGBDBM50398608(MARIZOMIB)
Affinity DataIC50:  28nM. Assay description: Reversible inhibition of human erythrocyte derived 20S proteasome subunit beta2 after 30 mins by fluorogenic assay
In DepthDetails ArticlePubMed
LigandPNGBDBM50398608(MARIZOMIB)
Affinity DataIC50:  1.30nM. Assay description: Inhibition of 20S proteasome (unknown origin) by fluorescence based assay
In DepthDetails PubMed
TargetProteasome subunit beta type-5(Homo sapiens (Human))
The Pennsylvania State University
Curated by ChEMBL
LigandPNGBDBM50398608(MARIZOMIB)
Affinity DataIC50:  3.5nM. Assay description: Inhibition of 20S proteasome beta 5c (unknown origin) after 1 hr by fluorescence based assay
In DepthDetails ArticlePubMed
TargetProteasome subunit beta type-1(Homo sapiens (Human))
University Of California San Diego
Curated by ChEMBL
LigandPNGBDBM50398608(MARIZOMIB)
Affinity DataIC50:  0.604nM. Assay description: Inhibition of 20S proteasome beta 1c (unknown origin) after 1 hr by fluorescence based assay
In DepthDetails ArticlePubMed
TargetProteasome subunit beta type-2(Homo sapiens (Human))
University Of California San Diego
Curated by ChEMBL
LigandPNGBDBM50398608(MARIZOMIB)
Affinity DataIC50: >11nM. Assay description: Inhibition of 20S proteasome beta 2c (unknown origin) after 1 hr by fluorescence based assay
In DepthDetails ArticlePubMed
TargetProteasome subunit beta type-5(Homo sapiens (Human))
The Pennsylvania State University
Curated by ChEMBL
LigandPNGBDBM50398608(MARIZOMIB)
Affinity DataIC50:  3.5nM. Assay description: Reversible inhibition of human erythrocyte derived 20S proteasome subunit beta5 after 30 mins by fluorogenic assay
In DepthDetails ArticlePubMed