BDBM50402227 CHEMBL2204736
SMILES CC(C)CCNC(=O)[C@@H]1CNC[C@H](CN2CC(=O)N(CC2(C)C)c2ccccc2Cl)C1
InChI Key InChIKey=XGYKQWJDBJCEAW-MOPGFXCFSA-N
Data  2 IC50
PDB links: 1 PDB ID matches this monomer.
  Tab Delimited (TSV)   2D SDfile   Computed 3D by Vconf -m prep SDfile
Find this compound or compounds like it in BindingDB:
Activity Spreadsheet -- Enzyme Inhibition Constant Data from BindingDB
Found 2 hits for monomerid = 50402227
TargetRenin(Homo sapiens (Human))
Daiichi Sankyo
Curated by ChEMBL
LigandPNGBDBM50402227(CHEMBL2204736)
Affinity DataIC50:  406nM. Assay description: Inhibition of recombinant human renin using Arg-Glu(EDANS)-Ile-His-Pro-Phe-His-Leu-Val-Ile-His-Thr-Lys(DABCYL)-Arg as substrate incubated for 10 mins...
TargetRenin(Macaca fascicularis)
Daiichi Sankyo
Curated by ChEMBL
LigandPNGBDBM50402227(CHEMBL2204736)
Affinity DataIC50: >1.00E+3nM. Assay description: Inhibition of renin in cynomolgus monkey plasma after 60 mins by competitive radioimmunoassay