BDBM50405108 CHEMBL54632
SMILES CCCc1ccc(Nc2cc(=O)[nH]c(=O)[nH]2)cc1C
InChI Key InChIKey=BKBQMDGKXQEVRZ-UHFFFAOYSA-N
Data  2 KI
  Tab Delimited (TSV)   2D SDfile   Computed 3D by Vconf -m prep SDfile
Find this compound or compounds like it in BindingDB:
Activity Spreadsheet -- Enzyme Inhibition Constant Data from BindingDB
Found 2 hits for monomerid = 50405108
TargetDNA topoisomerase 3(Bacillus subtilis)
TBA
Curated by ChEMBL
LigandPNGBDBM50405108(CHEMBL54632)
Affinity DataKi:  1.38E+4nM. Assay description: Inhibition constant against Bacillus subtilis azp-12 DNA topoisomerase III (mutant enzyme).
In DepthDetails ArticlePubMed
TargetDNA topoisomerase 3(Bacillus subtilis)
TBA
Curated by ChEMBL
LigandPNGBDBM50405108(CHEMBL54632)
Affinity DataKi:  9.79E+4nM. Assay description: Inhibition constant against Bacillus subtilis DNA topoisomerase III (wild type).
In DepthDetails ArticlePubMed