BDBM50405351 CHEMBL542261
SMILES [#7]\[#6](-[#7])=[#7]\c1ccc(cc1)-[#6](=O)-[#8]-c1cccc(c1)C#N
InChI Key InChIKey=NYKHWUCIZYMQBG-UHFFFAOYSA-N
Data  2 IC50
  Tab Delimited (TSV)   2D SDfile   Computed 3D by Vconf -m prep SDfile
Find this compound or compounds like it in BindingDB:
Activity Spreadsheet -- Enzyme Inhibition Constant Data from BindingDB
Found 1 hit for monomerid = 50405351
TargetWee1-like protein kinase(Homo sapiens (Human))TBA
LigandPNGBDBM50405351(CHEMBL5269524)
Affinity DataIC50:  0.510nM. Assay description: In vitro inhibition of angiotensin converting enzyme isolated from rat lung.
In DepthDetails