BDBM50405394 CHEMBL2051979
SMILES CO[C@H]1O[C@H](CO)[C@H](N[C@H]2C=C(CO)[C@@H](O)[C@H](O)[C@H]2O)[C@H](O)[C@H]1O
InChI Key InChIKey=UQSNMDDZJRJJQN-BRLHDQLVSA-N
Data  2 IC50
  Tab Delimited (TSV)   2D SDfile   Computed 3D by Vconf -m prep SDfile
Find this compound or compounds like it in BindingDB:
Activity Spreadsheet -- Enzyme Inhibition Constant Data from BindingDB
Found 2 hits for monomerid = 50405394
TargetSucrase-isomaltase, intestinal(Homo sapiens (Human))
TBA
Curated by ChEMBL
LigandPNGBDBM50405394(CHEMBL2051979)
Affinity DataIC50:  4.00E+3nM. Assay description: Alpha-D-glucosidase inhibitory activity and enzyme inhibition in vitro against porcine sucrase
In DepthDetails ArticlePubMed
TargetMaltase-glucoamylase(Homo sapiens (Human))
TBA
Curated by ChEMBL
LigandPNGBDBM50405394(CHEMBL2051979)
Affinity DataIC50:  8.00E+4nM. Assay description: Inhibitory activity against porcine maltase
In DepthDetails ArticlePubMed