BDBM50411324
SMILES C[C@H](CC=S(N)(=O)c1ccc(F)cc1)[C@H]1CC[C@H]2\C(CCC[C@]12C)=C\C=C1\C[C@@H](O)C[C@H](O)C1=C
InChI Key InChIKey=LKJGPJAUSRTLLY-TZXVHSDESA-N
Data  2 IC50
  Tab Delimited (TSV)   2D SDfile   Computed 3D by Vconf -m prep SDfile
Find this compound or compounds like it in BindingDB:
Activity Spreadsheet -- Enzyme Inhibition Constant Data from BindingDB
Found 2 hits for monomerid = 50411324
Target1,25-dihydroxyvitamin D(3) 24-hydroxylase, mitochondrial(Homo sapiens (Human))
The Johns Hopkins University
Curated by ChEMBL
LigandPNGBDBM50411324
Affinity DataIC50:  28nM. Assay description: Inhibition of human CYP24 hydroxylase expressed in V79 cells
In DepthDetails ArticlePubMed
Target1,25-dihydroxyvitamin D(3) 24-hydroxylase, mitochondrial(Homo sapiens (Human))
The Johns Hopkins University
Curated by ChEMBL
LigandPNGBDBM50411324
Affinity DataIC50:  44nM. Assay description: Inhibition of human CYP24 hydroxylase expressed in V79 cells
In DepthDetails ArticlePubMed