BDBM50414227 CHEMBL554904
SMILES COc1cc(ccc1O)-c1ccc2c(Nc3ccc(cc3NC2=O)C(=O)NCCCN2CCCC2)c1
InChI Key InChIKey=MYTCKGMYRDHNMQ-UHFFFAOYSA-N
Data  1 KI
  Tab Delimited (TSV)   2D SDfile   Computed 3D by Vconf -m prep SDfile
Find this compound or compounds like it in BindingDB:
Activity Spreadsheet -- Enzyme Inhibition Constant Data from BindingDB
Found 1 hit for monomerid = 50414227
TargetSerine/threonine-protein kinase Chk1(Homo sapiens (Human))
Abbott Laboratories
Curated by ChEMBL
LigandPNGBDBM50414227(CHEMBL554904)
Affinity DataKi:  20nM. Assay description: Inhibition of Chk1
In DepthDetails ArticlePubMed