BDBM50415090 CHEMBL576275
SMILES O=C1C[C@H]2CC[C@H](C1)N2c1ccc(C#N)c2ccccc12
InChI Key InChIKey=GQSWLDCYPZRVFY-ZIAGYGMSSA-N
Data  1 EC50
  Tab Delimited (TSV)   2D SDfile   Computed 3D by Vconf -m prep SDfile
Find this compound or compounds like it in BindingDB:
Activity Spreadsheet -- Enzyme Inhibition Constant Data from BindingDB
Found 1 hit for monomerid = 50415090
TargetAndrogen receptor(Mus musculus)
Acadia Pharmaceuticals
Curated by ChEMBL
LigandPNGBDBM50415090(CHEMBL576275)
Affinity DataEC50:  100nM. Assay description: Agonist activity at androgen receptor in mouse NIH3T3 cells transiently transfected with beta-galactosidase reporter gene assessed as cellular transf...
In DepthDetails ArticlePubMed