BDBM50418256 CHEMBL1614772
SMILES Nc1[nH]nc2cc(ccc12)-c1cc(nc(N)n1)N1CCOCC1
InChI Key InChIKey=IBSXLFOFZRSWEZ-UHFFFAOYSA-N
Data  5 IC50
PDB links: 1 PDB ID matches this monomer.
  Tab Delimited (TSV)   2D SDfile   Computed 3D by Vconf -m prep SDfile
Find this compound or compounds like it in BindingDB:
Activity Spreadsheet -- Enzyme Inhibition Constant Data from BindingDB
Found 5 hits for monomerid = 50418256
TargetTGF-beta receptor type-1(Homo sapiens (Human))
Glaxosmithkline
Curated by ChEMBL
LigandPNGBDBM50418256(CHEMBL1614772)
Affinity DataIC50: <1.00E+4nM. Assay description: Inhibition of ALK5
In DepthDetails ArticlePubMed
TargetRho-associated protein kinase 1(Homo sapiens (Human))
Glaxosmithkline
Curated by ChEMBL
LigandPNGBDBM50418256(CHEMBL1614772)
Affinity DataIC50: <1.00E+4nM. Assay description: Inhibition of ROCK1
In DepthDetails ArticlePubMed
TargetAurora kinase B(Homo sapiens (Human))
Glaxosmithkline
Curated by ChEMBL
LigandPNGBDBM50418256(CHEMBL1614772)
Affinity DataIC50: <1.00E+4nM. Assay description: Inhibition of aurora B
In DepthDetails ArticlePubMed
TargetAurora kinase A(Homo sapiens (Human))
Glaxosmithkline
Curated by ChEMBL
LigandPNGBDBM50418256(CHEMBL1614772)
Affinity DataIC50: <1.00E+4nM. Assay description: Inhibition of aurora A
In DepthDetails ArticlePubMed
Target3-phosphoinositide-dependent protein kinase 1(Homo sapiens (Human))
Glaxosmithkline
Curated by ChEMBL
LigandPNGBDBM50418256(CHEMBL1614772)
Affinity DataIC50:  316nM. Assay description: Inhibition of PDK1-mediated AKT phosphorylation at Thr308 residue in human PC3 cells by ELISA