BDBM50422052 CHEMBL109952::L-700417
SMILES OC(C[C@@H](Cc1ccccc1)C(=O)N[C@@H]1[C@H](O)Cc2ccccc12)C[C@@H](Cc1ccccc1)C(=O)N[C@@H]1[C@H](O)Cc2ccccc12
InChI Key InChIKey=NNOFYWJFSHHUJW-NDYAMACHSA-N
Data  1 KI  3 IC50  1 Kd
PDB links: 1 PDB ID matches this monomer.
  Tab Delimited (TSV)   2D SDfile   Computed 3D by Vconf -m prep SDfile
Find this compound or compounds like it in BindingDB:
Activity Spreadsheet -- Enzyme Inhibition Constant Data from BindingDB
Found 5 hits for monomerid = 50422052
TargetGag-Pol polyprotein [489-587,G537V,H558K,V571A](Human immunodeficiency virus)
Csir-National Chemical Laboratory
Curated by ChEMBL
LigandPNGBDBM50422052(CHEMBL109952 | L-700417)
Affinity DataKi:  0.370nM. Assay description: Inhibition of recombinant HIV protease expressed in inclusion bodies of Escherichia coli BL21 (DE3)
TargetGag-Pol polyprotein [489-587](Human immunodeficiency virus type 1)
Universidad De Alcal£
Curated by ChEMBL
LigandPNGBDBM50422052(CHEMBL109952 | L-700417)
Affinity DataIC50:  0.690nM. Assay description: Inhibitory activity against HIV-1 protease.
TargetProtease(Human immunodeficiency virus 1 (HIV-1))
University Of Minnesota
Curated by ChEMBL
LigandPNGBDBM50422052(CHEMBL109952 | L-700417)
Affinity DataIC50:  0.600nM. Assay description: Inhibition of HIV1 protease
TargetGag-Pol polyprotein [489-587](Human immunodeficiency virus type 1)
Universidad De Alcal£
Curated by ChEMBL
LigandPNGBDBM50422052(CHEMBL109952 | L-700417)
Affinity DataKd:  0.708nM. Assay description: Affinity for HIV Protease
TargetGag-Pol polyprotein [489-587](Human immunodeficiency virus type 1)
Universidad De Alcal£
Curated by ChEMBL
LigandPNGBDBM50422052(CHEMBL109952 | L-700417)
Affinity DataIC50:  0.690nM. Assay description: Inhibition of HIV-1 protease was determined in vitroChecked by Author