BDBM50423297 CHEMBL251541::Obelin
SMILES COc1cccc2C[C@@H]3[C@H](C[C@H](CN3C)C(=O)N3CCN(CC3)c3ccc(cc3)[N+]([O-])=O)Cc12
InChI Key InChIKey=INULNSAIIZKOQE-YOSAUDMPSA-N
Data  12 Kd
  Tab Delimited (TSV)   2D SDfile   Computed 3D by Vconf -m prep SDfile
Find this compound or compounds like it in BindingDB:
Activity Spreadsheet -- Enzyme Inhibition Constant Data from BindingDB
Found 12 hits for monomerid = 50423297
TargetSomatostatin receptor type 1(RAT)
Novartis Institutes For Biomedical Research
Curated by ChEMBL
LigandPNGBDBM50423297(CHEMBL251541 | Obelin)
Affinity DataKd:  0.708nM. Assay description: Displacement of [125I]SRIF14 from sst1 receptor in rat brain cortex membrane
In DepthDetails ArticlePubMed
TargetSomatostatin receptor type 4(Homo sapiens (Human))
Novartis Institutes For Biomedical Research
Curated by ChEMBL
LigandPNGBDBM50423297(CHEMBL251541 | Obelin)
Affinity DataKd:  1.51E+4nM. Assay description: Binding affinity to human recombinant sst4 receptor
In DepthDetails ArticlePubMed
TargetSomatostatin receptor type 2(RAT)
Novartis Institutes For Biomedical Research
Curated by ChEMBL
LigandPNGBDBM50423297(CHEMBL251541 | Obelin)
Affinity DataKd:  7.76E+3nM. Assay description: Displacement of [125I]SRIF14 from sst2 receptor in rat brain cortex membrane
In DepthDetails ArticlePubMed
TargetSomatostatin receptor type 3(Homo sapiens (Human))
Novartis Institutes For Biomedical Research
Curated by ChEMBL
LigandPNGBDBM50423297(CHEMBL251541 | Obelin)
Affinity DataKd:  8.71E+3nM. Assay description: Binding affinity to human recombinant sst3 receptor
In DepthDetails ArticlePubMed
TargetD(4) dopamine receptor(Homo sapiens (Human))
Novartis Institutes For Biomedical Research
Curated by ChEMBL
LigandPNGBDBM50423297(CHEMBL251541 | Obelin)
Affinity DataKd:  5nM. Assay description: Binding affinity to human dopamine D4 receptor
In DepthDetails ArticlePubMed
TargetSomatostatin receptor type 1(RAT)
Novartis Institutes For Biomedical Research
Curated by ChEMBL
LigandPNGBDBM50423297(CHEMBL251541 | Obelin)
Affinity DataKd:  0.708nM. Assay description: Displacement of [125I]SRIF14 from rat sst1 receptor from rat brain cortex membrane
In DepthDetails ArticlePubMed
Target5-hydroxytryptamine receptor 1D(Homo sapiens (Human))
Novartis Institutes For Biomedical Research
Curated by ChEMBL
LigandPNGBDBM50423297(CHEMBL251541 | Obelin)
Affinity DataKd:  112nM. Assay description: Binding affinity to human 5HT1D receptor
In DepthDetails ArticlePubMed
TargetBeta-1 adrenergic receptor(Homo sapiens (Human))
Novartis Institutes For Biomedical Research
Curated by ChEMBL
LigandPNGBDBM50423297(CHEMBL251541 | Obelin)
Affinity DataKd:  224nM. Assay description: Binding affinity to human adrenergic beta-1 receptor
In DepthDetails ArticlePubMed
TargetSomatostatin receptor type 5(Homo sapiens (Human))
Novartis Institutes For Biomedical Research
Curated by ChEMBL
LigandPNGBDBM50423297(CHEMBL251541 | Obelin)
Affinity DataKd:  1.78E+3nM. Assay description: Binding affinity to human recombinant sst5 receptor
In DepthDetails ArticlePubMed
TargetSomatostatin receptor type 2(Homo sapiens (Human))
Novartis Institutes For Biomedical Research
Curated by ChEMBL
LigandPNGBDBM50423297(CHEMBL251541 | Obelin)
Affinity DataKd:  3.63E+4nM. Assay description: Binding affinity to human recombinant sst2 receptor
In DepthDetails ArticlePubMed
TargetSomatostatin receptor type 2(RAT)
Novartis Institutes For Biomedical Research
Curated by ChEMBL
LigandPNGBDBM50423297(CHEMBL251541 | Obelin)
Affinity DataKd:  7.76E+3nM. Assay description: Displacement of [125I]SRIF14 from rat sst2 receptor from rat brain cortex membrane
In DepthDetails ArticlePubMed
TargetSomatostatin receptor type 1(Homo sapiens (Human))
Novartis Institutes For Biomedical Research
Curated by ChEMBL
LigandPNGBDBM50423297(CHEMBL251541 | Obelin)
Affinity DataKd:  10nM. Assay description: Binding affinity to human recombinant sst1 receptor
In DepthDetails ArticlePubMed