BDBM50423543 19-Nor-Dihydrotestosterone::CHEMBL260641
SMILES C[C@]12CC[C@H]3[C@@H](CCC4CC(=O)CC[C@H]34)[C@@H]1CC[C@@H]2O
InChI Key InChIKey=RHVBIEJVJWNXBU-ARIDVEPSSA-N
Data  1 Kd
  Tab Delimited (TSV)   2D SDfile   Computed 3D by Vconf -m prep SDfile
Find this compound or compounds like it in BindingDB:
Activity Spreadsheet -- Enzyme Inhibition Constant Data from BindingDB
Found 1 hit for monomerid = 50423543
TargetSex hormone-binding globulin(Homo sapiens (Human))
University Of British Columbia
Curated by ChEMBL
LigandPNGBDBM50423543(19-Nor-Dihydrotestosterone | CHEMBL260641)
Affinity DataKd:  4.40nM. Assay description: Displacement of [3H]5alpha dihydrotestosterone from human sex hormone binding globulin
In DepthDetails ArticlePubMed