BDBM50425189 CHEMBL2314217
SMILES CN(C)Cc1cc(I)ccc1Sc1ccccc1CO
InChI Key InChIKey=XXMFGLMOHJMNJJ-UHFFFAOYSA-N
Data  1 KI
  Tab Delimited (TSV)   2D SDfile   Computed 3D by Vconf -m prep SDfile
Find this compound or compounds like it in BindingDB:
Activity Spreadsheet -- Enzyme Inhibition Constant Data from BindingDB
Found 1 hit for monomerid = 50425189
TargetSodium-dependent serotonin transporter(Homo sapiens (Human))
University Of Pennsylvania
Curated by ChEMBL
LigandPNGBDBM50425189(CHEMBL2314217)
Affinity DataKi:  0.0300nM. Assay description: Inhibition of [125I]IDAM uptake at SERT (unknown origin) expressed in LLC-PK1 cell membranes
In DepthDetails ArticlePubMed