BDBM50426463 CHEMBL2322675
SMILES O[C@H]1CC[C@@H](CC1)Nc1cc(cc(n1)C#N)-c1c[nH]c2ncccc12
InChI Key InChIKey=SQJXCRCSAJZPMM-CTYIDZIISA-N
Data  1 KI
  Tab Delimited (TSV)   2D SDfile   Computed 3D by Vconf -m prep SDfile
Find this compound or compounds like it in BindingDB:
Activity Spreadsheet -- Enzyme Inhibition Constant Data from BindingDB
Found 1 hit for monomerid = 50426463
TargetCell division cycle 7-related protein kinase(Homo sapiens (Human))
Abbott Laboratories
Curated by ChEMBL
LigandPNGBDBM50426463(CHEMBL2322675)
Affinity DataKi:  5.5nM. Assay description: Inhibition of human Cdc7 using biotin-C6linker-TPSDSLIYDDGLS as substrate after 1 hr
In DepthDetails ArticlePubMed