BDBM50428583 CHEMBL2337955
SMILES COc1ccc(C2=NNC(=O)C[C@@H]2C)c2cc(nn12)C(F)(F)F
InChI Key InChIKey=IDPCPRHAKGSESY-ZETCQYMHSA-N
Data  2 IC50
  Tab Delimited (TSV)   2D SDfile   Computed 3D by Vconf -m prep SDfile
Find this compound or compounds like it in BindingDB:
Activity Spreadsheet -- Enzyme Inhibition Constant Data from BindingDB
Found 2 hits for monomerid = 50428583
TargetcGMP-inhibited 3',5'-cyclic phosphodiesterase 3A(Homo sapiens (Human))
Kyorin Pharmaceutical
Curated by ChEMBL
LigandPNGBDBM50428583(CHEMBL2337955)
Affinity DataIC50:  360nM. Assay description: Inhibition of PDE3A (unknown origin) by radiochemical assay
In DepthDetails ArticlePubMed
TargetcAMP-specific 3',5'-cyclic phosphodiesterase 4B(Homo sapiens (Human))
Kyorin Pharmaceutical
Curated by ChEMBL
LigandPNGBDBM50428583(CHEMBL2337955)
Affinity DataIC50:  42nM. Assay description: Inhibition of PDE4B (unknown origin) by radiochemical assay
In DepthDetails ArticlePubMed