BDBM50432625 CHEMBL2347365
SMILES COc1ccc(nc1)C(=O)Nc1ccc(F)c(c1)[C@@]1(C)N=C(N)OCC1(F)F
InChI Key InChIKey=HNRVVAHVDIBECJ-QGZVFWFLSA-N
Data  3 IC50
  Tab Delimited (TSV)   2D SDfile   Computed 3D by Vconf -m prep SDfile
Find this compound or compounds like it in BindingDB:
Activity Spreadsheet -- Enzyme Inhibition Constant Data from BindingDB
Found 3 hits for monomerid = 50432625
TargetBeta-secretase 1(Homo sapiens (Human))
F. Hoffmann-La Roche
Curated by ChEMBL
LigandPNGBDBM50432625(CHEMBL2347365)
Affinity DataIC50:  61nM. Assay description: Inhibition of human BACE1 in HEK293 cells transfected with wild type APP assessed as reduction of amyloid beta40 level after 18 to 20 hrs by AlphaLIS...
In DepthDetails ArticlePubMed
TargetBeta-secretase 2(Homo sapiens (Human))
F. Hoffmann-La Roche
Curated by ChEMBL
LigandPNGBDBM50432625(CHEMBL2347365)
Affinity DataIC50:  45nM. Assay description: Inhibition of human BACE2 using MR121-labeled substrate incubated for 4 mins prior to substrate addition measured after 2 mins by spectrophotometric ...
In DepthDetails ArticlePubMed
TargetBeta-secretase 1(Homo sapiens (Human))
F. Hoffmann-La Roche
Curated by ChEMBL
LigandPNGBDBM50432625(CHEMBL2347365)
Affinity DataIC50:  51nM. Assay description: Inhibition of human BACE1 using MR121-labeled substrate incubated for 4 mins prior to substrate addition measured after 2 mins by spectrophotometric ...
In DepthDetails ArticlePubMed