BDBM50440262 CHEMBL2426674
SMILES COc1ccc(CC(=O)N2CCC3(CN(Cc4ccc(cc4Cl)-c4ncccn4)C3)CC2)cc1
InChI Key InChIKey=SKPDLRFQCWNVQC-UHFFFAOYSA-N
Data  1 KI  1 IC50
  Tab Delimited (TSV)   2D SDfile   Computed 3D by Vconf -m prep SDfile
Find this compound or compounds like it in BindingDB:
Activity Spreadsheet -- Enzyme Inhibition Constant Data from BindingDB
Found 2 hits for monomerid = 50440262
TargetMuscarinic acetylcholine receptor M2(Homo sapiens (Human))
Pfizer
Curated by ChEMBL
LigandPNGBDBM50440262(CHEMBL2426674)
Affinity DataKi:  1.95E+3nM. Assay description: Displacement of N-methyl [3H]-scopolamine from recombinant human muscarinic acetylcholine receptor M2 expressed in CHO cells after 2 hrs by liquid sc...
In DepthDetails ArticlePubMed
TargetGrowth hormone secretagogue receptor type 1(Homo sapiens (Human))
Pfizer
Curated by ChEMBL
LigandPNGBDBM50440262(CHEMBL2426674)
Affinity DataIC50:  16nM. Assay description: Displacement of [125I]-ghrelin from human GHS-R1a expressed in tetracycline inducible HEK293 cells after 8 hrs by liquid scintillation counting
In DepthDetails ArticlePubMed