BDBM50442144 CHEMBL2441272
SMILES O[C@H]1CC[C@@H](CC1)Nc1nc(Cc2ccccc2)cc(Nc2nc3ccc(cc3s2)C(F)(F)F)n1
InChI Key InChIKey=RWUJEVMUBYCUBS-UAPYVXQJSA-N
Data  2 KI
  Tab Delimited (TSV)   2D SDfile   Computed 3D by Vconf -m prep SDfile
Find this compound or compounds like it in BindingDB:
Activity Spreadsheet -- Enzyme Inhibition Constant Data from BindingDB
Found 2 hits for monomerid = 50442144
TargetTyrosine-protein kinase ITK/TSK(Homo sapiens (Human))
Glaxosmithkline
Curated by ChEMBL
LigandPNGBDBM50442144(CHEMBL2441272)
Affinity DataKi:  13nM. Assay description: Inhibition of recombinant human FLAG-tagged ITK using biotinylated GST-SAM68 as substrate after 30 mins
In DepthDetails ArticlePubMed
TargetAurora kinase B(Homo sapiens (Human))
Glaxosmithkline
Curated by ChEMBL
LigandPNGBDBM50442144(CHEMBL2441272)
Affinity DataKi:  251nM. Assay description: Inhibition of Aurora-B (unknown origin) using 5FAM-PKAtide as substrate after 120 mins
In DepthDetails ArticlePubMed