BDBM50443770 CHEMBL3094104
SMILES Nc1ccn([C@@H]2O[C@H](CNC(=O)c3cn4ccsc4n3)[C@@H](O)[C@H]2O)c(=O)n1
InChI Key InChIKey=CNDLQBMTBSBAHK-UORFTKCHSA-N
Data  1 Kd
  Tab Delimited (TSV)   2D SDfile   Computed 3D by Vconf -m prep SDfile
Find this compound or compounds like it in BindingDB:
Activity Spreadsheet -- Enzyme Inhibition Constant Data from BindingDB
Found 1 hit for monomerid = 50443770
Target2-C-methyl-D-erythritol 2,4-cyclodiphosphate synthase(Burkholderia pseudomallei (strain K96243))
Northern Illinois University
Curated by ChEMBL
LigandPNGBDBM50443770(CHEMBL3094104)
Affinity DataKd:  7.00E+4nM. Assay description: Binding affinity to Burkolderia pseudomallei IspF by surface plasmon resonance method
In DepthDetails ArticlePubMed