BDBM50445067 CHEMBL3098917
SMILES Nc1nc2nc(cnc2c(=O)[nH]1)C(=O)NCCNC(=O)Nc1ccccc1
InChI Key InChIKey=UGNDSTADFKFZJF-UHFFFAOYSA-N
Data  1 IC50
PDB links: 1 PDB ID matches this monomer.
  Tab Delimited (TSV)   2D SDfile   Computed 3D by Vconf -m prep SDfile
Find this compound or compounds like it in BindingDB:
Activity Spreadsheet -- Enzyme Inhibition Constant Data from BindingDB
Found 1 hit for monomerid = 50445067
TargetRicin(Ricinus communis)
TBA
Curated by ChEMBL
LigandPNGBDBM50445067(CHEMBL3098917)
Affinity DataIC50:  2.09E+5nM. Assay description: Inhibition of castor bean ricin toxin A after 90 mins by luciferase reporter gene assay