BDBM50446134 CHEMBL3108877
SMILES CNC(=O)[C@@H]1C[C@@H](O)CN1C(C)=O
InChI Key InChIKey=XAZYBLFYZNUKHD-RQJHMYQMSA-N
Data  2 Kd
PDB links: 1 PDB ID matches this monomer.
  Tab Delimited (TSV)   2D SDfile   Computed 3D by Vconf -m prep SDfile
Find this compound or compounds like it in BindingDB:
Activity Spreadsheet -- Enzyme Inhibition Constant Data from BindingDB
Found 2 hits for monomerid = 50446134
Targetvon Hippel-Lindau disease tumor suppressor(Homo sapiens (Human))
University Of Cambridge
Curated by ChEMBL
LigandPNGBDBM50446134(CHEMBL3108877)
Affinity DataKd:  4.90E+6nM. Assay description: Displacement of 19-mer HIF-1alpha peptide from VHL (unknown origin) by isothermal titration calorimetry analysis
TargetElongin-C(Homo sapiens (Human))
University Of Utah
Curated by ChEMBL
LigandPNGBDBM50446134(CHEMBL3108877)
Affinity DataKd:  1.00E+7nM. Assay description: Displacement of FAM-DEALAHyp-YIPD from VHL/elongins-B/elonginC (unknown origin) by isothermal titration calorimetric analysis